{"text_format":"1","workbook":"xlsx","n_sheets":10,"sheets":["Instructions","Cars TCO Dashboard","Summary","Currency","Capital Cost","Operational Cost","Financing","TCO_1","Plots","References"],"not_rendered":{"charts":9,"images":13,"macros":0,"external_links":2,"defined_names":0,"comments":0,"pivot_tables":0},"unopened":[],"bounds":{"document_bytes":16777216,"sheet_cells":100000,"rows_first":2000,"rows_last":500,"rows_between":2000,"halvings":0,"cell_chars":16384,"cell_head_chars":4096},"cells_cut":0,"cells_raw":0,"read":"whole","date_system":"1900"}

{"sheet":"Instructions","index":0,"n_rows":42,"n_cols":6,"rows_kept":42,"cut":false,"hidden":false,"merged":[[41,1,42,14],[34,1,34,3],[34,5,34,13],[35,1,35,3],[35,5,35,13],[36,1,36,3],[36,5,36,13],[31,1,31,3],[31,5,31,13],[32,1,32,3],[32,5,32,13],[33,1,33,3],[33,5,33,13],[30,1,30,3],[30,5,30,13],[24,1,24,3],[24,5,24,13],[25,1,25,3],[25,5,25,13],[26,1,26,3],[26,5,26,13],[27,1,27,3],[27,5,27,13],[28,1,28,13],[29,1,29,3],[29,5,29,13],[23,1,23,3],[23,5,23,13],[17,1,17,3],[17,5,17,13],[18,1,18,3],[18,5,18,13],[19,1,19,3],[19,5,19,13],[20,1,20,3],[20,5,20,13],[21,1,21,3],[21,5,21,13],[22,1,22,13],[16,1,16,3],[16,5,16,13],[10,1,10,3],[10,5,10,13],[11,1,11,3],[11,5,13,13],[12,1,12,3],[14,1,14,13],[15,1,15,3],[15,5,15,13],[9,1,9,3],[9,5,9,13],[1,1,1,13],[3,1,3,13],[5,1,5,8],[8,1,8,3],[8,5,8,13]]}
[]
[null,"HOW TO USE THE DYNAMIC TOTAL COST OF OWNERSHIP DASHBOARD"]
[]
[null,"All cells highlighted Green are Input cells. Values can only be edited in these cells to observe the dynamic changes in the dashboard on the right."]
[]
[null,"All cells highlighted Gray are Fixed cells. These values cannot be edited."]
[]
[]
[null,"CELL NAME",null,null,"FUNCTION","ACTION REQUIRED"]
[null,"Vehicle Holding Period (Year)",null,null,"Editable","Use the drop down menu on Cell C5 to choose the Vehicle holding period from 1 to 10 years "]
[null,"Daily Distance Travelled (km)",null,null,"Editable","Use the arrows on the right to increase/decrease to input Daily Distance Travelled in km"]
[null,"Daily Distance Travelled (mi)",null,null,"Fixed"]
[null,"Annual Distance Travelled (km)",null,null,"Fixed"]
[null,"Annual Distance Travelled (mi)",null,null,"Fixed"]
[]
{"$rows_left_out":28}
{"sheet":"Cars TCO Dashboard","index":1,"n_rows":60,"n_cols":51,"rows_kept":60,"cut":false,"hidden":false,"merged":[[2,1,2,3],[14,3,14,5],[16,2,16,5],[4,3,4,5]]}
[null,null,null,null,null,null,null,null,null,null,null,null,null,null,null,null,null,null,null,null,null,null,null,null,null,null,null,null,null,null,null,null,null,null,null,null,null,null,null,null,"YEAR 10","TCO",null,null,null,null,null,"DYNAMIC","TCO"]
[null,null,null,null,null,null,null,null,null,null,null,null,null,null,null,null,null,null,null,null,null,null,null,null,null,null,null,null,null,null,null,null,null,null,null,null,null,null,null,null,"e-Car",{"$f":"TCO_1!C11","v":5.9507885877641753},null,null,null,null,null,"e-Car",{"$f":"VLOOKUP($C$5,$AU$11:$AY$21,2,0)","v":8.8374560391457972}]
[null,null,null,null,null,null,null,null,null,null,null,null,null,null,null,null,null,null,null,null,null,null,null,null,null,null,null,null,null,null,null,null,null,null,null,null,null,null,null,null,"CNG-Car",{"$f":"TCO_1!D11","v":5.237087933633048},null,null,null,null,null,"CNG-Car",{"$f":"VLOOKUP($C$5,$AU$11:$AY$21,3,0)","v":7.902867191207716}]
[null,null,null,null,null,null,null,null,null,null,null,null,null,null,null,null,null,null,null,null,null,null,null,null,null,null,null,null,null,null,null,null,null,null,null,null,null,null,null,null,"Petrol-Car",{"$f":"TCO_1!E11","v":7.0723875403774343},null,null,null,null,null,"Petrol-Car",{"$f":"VLOOKUP($C$5,$AU$11:$AY$21,4,0)","v":10.096233778103073}]
[null,"Vehicle Holding Period (Year)",5,"              Use Drop down to choose Holding Period",null,null,null,null,null,null,null,null,null,null,null,null,null,null,null,null,null,null,null,null,null,null,null,null,null,null,null,null,null,null,null,null,null,null,null,null,"Diesel-Car",{"$f":"TCO_1!F11","v":7.2830694009171024},null,null,null,null,null,"Diesel-Car",{"$f":"VLOOKUP($C$5,$AU$11:$AY$21,5,0)","v":10.748805605353914}]
[]
[null,"Daily Distance Travelled (km)",110,null,"(Use Arrows to input Distance)"]
[null,"Daily Distance Travelled (mi)",{"$f":"C7*0.621371","v":68.350809999999996}]
[]
[null,"Annual Distance Travelled (km)",{"$f":"C7*365","v":40150}]
[null,"Annual Distance Travelled (mi)",{"$f":"C8*365","v":24948.04565},null,null,null,null,null,null,null,null,null,null,null,null,null,null,null,null,null,null,null,null,null,null,null,null,null,null,null,null,null,null,null,null,null,null,null,null,null,"Operational Years","e-Car ","CNG-Car ","Petrol-Car ","Diesel-Car ",null,null,"e-Car ","CNG-Car ","Petrol-Car ","Diesel-Car "]
[null,null,null,null,null,null,null,null,null,null,null,null,null,null,null,null,null,null,null,null,null,null,null,null,null,null,null,null,null,null,null,null,null,null,null,null,null,null,null,null,"Year 1",{"$f":"TCO_1!C31","v":31.363216752157829},{"$f":"TCO_1!C34","v":28.122471468645255},{"$f":"TCO_1!C37","v":29.831855819470174},{"$f":"TCO_1!C40","v":35.694756889887351},null,1,{"$f":"IF($C$5=AU12,AP12:AS12,)","v":0}]
[null,null,null,null,null,null,null,null,null,null,null,null,null,null,null,null,null,null,null,null,null,null,null,null,null,null,null,null,null,null,null,null,null,null,null,null,null,null,null,null,"Year 2",{"$f":"TCO_1!D31","v":17.322540352716018},{"$f":"TCO_1!D34","v":15.55092706434476},{"$f":"TCO_1!D37","v":17.740201289227599},{"$f":"TCO_1!D40","v":20.259621772138207},null,2,{"$f":"IF($C$5=AU13,AP13:AS13,)","v":0}]
[null,null,null,null,null,null,null,null,null,null,null,null,null,null,null,null,null,null,null,null,null,null,null,null,null,null,null,null,null,null,null,null,null,null,null,null,null,null,null,null,"Year 3",{"$f":"TCO_1!E31","v":12.623561412818757},{"$f":"TCO_1!E34","v":11.328621888882614},{"$f":"TCO_1!E37","v":13.594087583858576},{"$f":"TCO_1!E40","v":15.039923452567526},null,3,{"$f":"IF($C$5=AU14,AP14:AS14,)","v":0}]
[null,null,"INR",null,null,null,null,null,null,null,null,null,null,null,null,null,null,null,null,null,null,null,null,null,null,null,null,null,null,null,null,null,null,null,null,null,null,null,null,null,"Year 4",{"$f":"TCO_1!F31","v":10.262198030584448},{"$f":"TCO_1!F34","v":9.1966094975342525},{"$f":"TCO_1!F37","v":11.443013514873057},{"$f":"TCO_1!F40","v":12.38017169827952},null,4,{"$f":"IF($C$5=AU15,AP15:AS15,)","v":0}]
{"$rows_left_out":46}
{"sheet":"Summary","index":2,"n_rows":30,"n_cols":5,"rows_kept":30,"cut":false,"hidden":false,"merged":[[0,0,0,1],[11,0,11,4],[19,0,19,4],[27,0,27,4]]}
["TRAVEL DETAILS "]
["Number of Vehicle",1]
["Life of Vehicle (yrs)",10]
["Annual drive distance (KM)",{"$f":"'Cars TCO Dashboard'!C10","v":40150}]
["Total Distance Travel (KM)",{"$f":"B3*B4","v":401500}]
["LIB Cost (USD/kWh)",{"$f":"'Cars TCO Dashboard'!C41","v":137}]
["USD to INR",73]
["VRLA Cost (USD/kWh)",100]
["General Inputs","e-Car","CNG - Car","Petrol - Car","Diesel - Car"]
["Discount rate (%)",{"$f":"'Cars TCO Dashboard'!C25","v":0.1},{"$f":"'Cars TCO Dashboard'!D25","v":0.1},{"$f":"'Cars TCO Dashboard'!E25","v":0.1},{"$f":"'Cars TCO Dashboard'!F25","v":0.1}]
["Resale rate (%)",{"$f":"'Cars TCO Dashboard'!C26","v":0.2},{"$f":"'Cars TCO Dashboard'!D26","v":0.1},{"$f":"'Cars TCO Dashboard'!E26","v":0.1},{"$f":"'Cars TCO Dashboard'!F26","v":0.1}]
[]
["Capital Cost","e-Car","CNG - Car","Petrol - Car","Diesel - Car"]
["Total Vehicle Cost (₹)",{"$f":"'Capital Cost'!B8","v":1605080.8387612156},{"$f":"'Capital Cost'!C8","v":1064440.4817068249},{"$f":"'Capital Cost'!D8","v":1011885.1531689151},{"$f":"'Capital Cost'!E8","v":1301905.0689428649}]
["Resale Value (₹)",{"$f":"B14*B10","v":160508.08387612156},{"$f":"C14*C11","v":106444.04817068249},{"$f":"D14*D11","v":101188.51531689151},{"$f":"E14*E11","v":130190.50689428649}]
{"$rows_left_out":16}
{"sheet":"Currency","index":3,"n_rows":55,"n_cols":12,"rows_kept":55,"cut":false,"hidden":true,"merged":[[15,10,15,11],[6,9,7,9],[1,1,1,3],[15,1,15,2],[15,4,15,5],[15,7,15,8],[1,6,1,7]]}
[]
[null,"CURRENCY CONVERSION",null,null,null,null,"WEIGHT CONVERSION"]
[]
[null,"USD","INR","Conversion",null,null,"gal","L"]
[null,1,74,{"$f":"B5*C5","v":74},null,null,1,3.78]
[]
[null,"EURO","INR","Conversion",null,null,"GGE","Kg",null,"NIST Handbook 44 Appendix D (Pg 3-110) as follows: \"1 Gasoline [US] gallon equivalent (GGE) means 2.567 kg (5.660 lb) of natural gas\""]
[null,1,82,{"$f":"B8*C8","v":82},null,null,1,2.5670000000000002]
[]
[]
[]
[]
[]
[]
[]
{"$rows_left_out":41}
{"sheet":"Capital Cost","index":4,"n_rows":42,"n_cols":6,"rows_kept":42,"cut":false,"hidden":true,"merged":[[23,0,23,4],[28,0,28,4],[33,0,33,4],[38,0,38,4]]}
["Vehicle Cost","e-4W ","CNG-4W","Petrol-4W","Diesel-4W"]
["Purchase Cost (₹)",{"$f":"VLOOKUP('Cars TCO Dashboard'!$C$15,'Capital Cost'!$A$25:$E$27,2,0)","v":1158000},{"$f":"VLOOKUP('Cars TCO Dashboard'!$C$15,'Capital Cost'!$A$25:$E$27,3,0)","v":728000},{"$f":"VLOOKUP('Cars TCO Dashboard'!$C$15,'Capital Cost'!$A$25:$E$27,4,0)","v":704800},{"$f":"VLOOKUP('Cars TCO Dashboard'!$C$15,'Capital Cost'!$A$25:$E$27,5,0)","v":910700}]
["Tax (₹)",{"$f":"VLOOKUP('Cars TCO Dashboard'!$C$15,'Capital Cost'!$A$30:$E$32,2,0)","v":66241},{"$f":"VLOOKUP('Cars TCO Dashboard'!$C$15,'Capital Cost'!$A$30:$E$32,3,0)","v":80636},{"$f":"VLOOKUP('Cars TCO Dashboard'!$C$15,'Capital Cost'!$A$30:$E$32,4,0)","v":70420},{"$f":"VLOOKUP('Cars TCO Dashboard'!$C$15,'Capital Cost'!$A$30:$E$32,5,0)","v":80736}]
["Insurance (₹)",{"$f":"VLOOKUP('Cars TCO Dashboard'!$C$15,'Capital Cost'!$A$35:$E$37,2,0)","v":40706},{"$f":"VLOOKUP('Cars TCO Dashboard'!$C$15,'Capital Cost'!$A$35:$E$37,3,0)","v":36139},{"$f":"VLOOKUP('Cars TCO Dashboard'!$C$15,'Capital Cost'!$A$35:$E$37,4,0)","v":24000},{"$f":"VLOOKUP('Cars TCO Dashboard'!$C$15,'Capital Cost'!$A$35:$E$37,5,0)","v":35676}]
["Financing Component (₹)",{"$f":"Financing!B17","v":340133.83876121556},{"$f":"Financing!C17","v":219665.48170682485},{"$f":"Financing!D17","v":212665.15316891507},{"$f":"Financing!E17","v":274793.06894286489}]
["Total Financial Incentive (₹)",0,{"$f":"VLOOKUP('Cars TCO Dashboard'!$C$15,'Capital Cost'!$A$40:$E$42,3,0)","v":0},{"$f":"VLOOKUP('Cars TCO Dashboard'!$C$15,'Capital Cost'!$A$40:$E$42,4,0)","v":0},{"$f":"VLOOKUP('Cars TCO Dashboard'!$C$15,'Capital Cost'!$A$40:$E$42,5,0)","v":0}]
["Misc. Cost (₹)",0,0,0,0]
["Total Vehicle Cost (₹)",{"$f":"((B2+B3+B4+B5+B7)-B6)","v":1605080.8387612156},{"$f":"((C2+C3+C4+C5+C7)-C6)","v":1064440.4817068249},{"$f":"((D2+D3+D4+D5+D7)-D6)","v":1011885.1531689151},{"$f":"((E2+E3+E4+E5+E7)-E6)","v":1301905.0689428649}]
[]
["Charging Infrastructure Cost","e-4W ","CNG-4W","Petrol-4W","Diesel-4W"]
["No. of Slow Charger (SC)",0,0,0,0]
["Cost of SC per unit (₹)",0,0,0,0]
["Total Cost of SC (₹)",{"$f":"B11*B12","v":0},{"$f":"C11*C12","v":0},{"$f":"D11*D12","v":0},0]
["No. of Fact Charger (FC)",0,0,0,0]
["Cost of FC per unit (₹)",0,0,0,0,0]
{"$rows_left_out":28}
{"sheet":"Operational Cost","index":5,"n_rows":47,"n_cols":5,"rows_kept":47,"cut":false,"hidden":true,"merged":[[33,0,33,4],[38,0,38,4],[43,0,43,4]]}
["Staff cost","e-4W ","CNG-4W","Petrol-4W","Diesel-4W"]
["Staff Cost (₹ / Month)",{"$f":"VLOOKUP('Cars TCO Dashboard'!$C$15,'Operational Cost'!$A$35:$B$37,2,0)","v":0},{"$f":"VLOOKUP('Cars TCO Dashboard'!$C$15,'Operational Cost'!$A$35:$B$37,2,0)","v":0},{"$f":"VLOOKUP('Cars TCO Dashboard'!$C$15,'Operational Cost'!$A$35:$B$37,2,0)","v":0},{"$f":"VLOOKUP('Cars TCO Dashboard'!$C$15,'Operational Cost'!$A$35:$B$37,2,0)","v":0}]
["Other Support staff cost (₹ / Month)",0,0,0,0]
["Total Annual Staff Cost (₹)",{"$f":"((B2+B3)*12)","v":0},{"$f":"((C2+C3)*12)","v":0},0,0]
["Per km Staff Cost",{"$f":"B4/Summary!$B$4","v":0},{"$f":"C4/Summary!$B$4","v":0},{"$f":"D4/Summary!$B$4","v":0},{"$f":"E4/Summary!$B$4","v":0}]
[]
["Average Fuel Cost","e-4W ","CNG-4W","Petrol-4W","Diesel-4W"]
["Fuel cost (₹/kWh; ₹/kg; ₹/L)",{"$f":"VLOOKUP('Cars TCO Dashboard'!$C$15,'Operational Cost'!$A$45:$E$47,2,0)","v":6},{"$f":"VLOOKUP('Cars TCO Dashboard'!$C$15,'Operational Cost'!$A$45:$E$47,3,0)","v":47},{"$f":"VLOOKUP('Cars TCO Dashboard'!$C$15,'Operational Cost'!$A$45:$E$47,4,0)","v":100},{"$f":"VLOOKUP('Cars TCO Dashboard'!$C$15,'Operational Cost'!$A$45:$E$47,5,0)","v":88}]
["Mileage (km/kWh; km/L)",{"$f":"'Cars TCO Dashboard'!C47","v":8.59},{"$f":"'Cars TCO Dashboard'!D47","v":28.4},{"$f":"'Cars TCO Dashboard'!E47","v":20.100000000000001},{"$f":"'Cars TCO Dashboard'!F47","v":25.4}]
["Annual fuel consumption (kWh; L)",{"$f":"Summary!B4/B9","v":4674.0395809080328},{"$f":"Summary!B4/C9","v":1413.7323943661972},{"$f":"Summary!B4/D9","v":1997.5124378109451},{"$f":"Summary!$B$4/E9","v":1580.7086614173229}]
["Total Annual Fuel Cost ( ₹ )",{"$f":"(B10*B8)","v":28044.237485448197},{"$f":"(C10*C8)","v":66445.42253521127},{"$f":"(D10*D8)","v":199751.24378109453},{"$f":"(E10*E8)","v":139102.36220472443}]
["Per km Fuel Cost",{"$f":"B11/Summary!$B$4","v":0.69848661233993015},{"$f":"C11/Summary!$B$4","v":1.6549295774647887},{"$f":"D11/Summary!$B$4","v":4.9751243781094523},{"$f":"E11/Summary!$B$4","v":3.4645669291338588}]
[]
["Maintenance Cost","e-4W ","CNG-4W","Petrol-4W","Diesel-4W"]
["Annual Maintenance Cost (₹)",{"$f":"VLOOKUP('Cars TCO Dashboard'!$C$15,'Operational Cost'!$A$40:$E$42,2,0)","v":2600},{"$f":"VLOOKUP('Cars TCO Dashboard'!$C$15,'Operational Cost'!$A$40:$E$42,3,0)","v":4699},{"$f":"VLOOKUP('Cars TCO Dashboard'!$C$15,'Operational Cost'!$A$40:$E$42,4,0)","v":4699},{"$f":"VLOOKUP('Cars TCO Dashboard'!$C$15,'Operational Cost'!$A$40:$E$42,5,0)","v":5261}]
{"$rows_left_out":33}
{"sheet":"Financing","index":6,"n_rows":24,"n_cols":5,"rows_kept":24,"cut":false,"hidden":true,"merged":[[20,0,20,4],[25,0,25,4]]}
["Vehicle Cost","e-4W ","CNG - 4W","Petrol - 4W","Diesel - 4W"]
["Total Cost of Car (₹)",{"$f":"'Cars TCO Dashboard'!C20-'Cars TCO Dashboard'!C23","v":946000},{"$f":"'Cars TCO Dashboard'!D20","v":728000},{"$f":"'Cars TCO Dashboard'!E20","v":704800},{"$f":"'Cars TCO Dashboard'!F20","v":910700}]
["Share of Operator (%)",{"$f":"100%-B6","v":0.9},{"$f":"100%-C6","v":0.9},0.9,0.9]
["Share of Operator (₹)",{"$f":"B3*B2","v":851400},{"$f":"C3*C2","v":655200},{"$f":"D3*D2","v":634320},{"$f":"E3*E2","v":819630}]
["Processing  Fees",{"$f":"IF(B8=0,0,IF(B4*0.5%>500,B4*0.5%,500))","v":4257},{"$f":"IF(C8=0,0,IF(C4*0.5%>500,C4*0.5%,500))","v":3276},3171.6,4098.1499999999996]
["Equity %",{"$f":"'Cars TCO Dashboard'!C31","v":0.1},{"$f":"'Cars TCO Dashboard'!D31","v":0.1},{"$f":"'Cars TCO Dashboard'!E31","v":0.1},{"$f":"'Cars TCO Dashboard'!F31","v":0.1}]
["Equity (₹)",{"$f":"(B6*B2)","v":94600},{"$f":"(C6*C2)","v":72800},{"$f":"(D6*D2)","v":70480},{"$f":"(E6*E2)","v":91070}]
["Loan amount (₹)",{"$f":"B4","v":851400},{"$f":"C4","v":655200},{"$f":"D4","v":634320},{"$f":"E4","v":819630}]
["Interest rate (%)",{"$f":"'Cars TCO Dashboard'!C30","v":0.1},{"$f":"'Cars TCO Dashboard'!D30","v":8.5000000000000006E-2},{"$f":"'Cars TCO Dashboard'!E30","v":8.5000000000000006E-2},{"$f":"'Cars TCO Dashboard'!F30","v":8.5000000000000006E-2}]
["Term of payment (yrs)",{"$f":"'Cars TCO Dashboard'!C29","v":7},{"$f":"'Cars TCO Dashboard'!D29","v":7},{"$f":"'Cars TCO Dashboard'!E29","v":7},{"$f":"'Cars TCO Dashboard'!F29","v":7}]
["No of EMI (Yearly)",{"$f":"B10*12","v":84},{"$f":"C10*12","v":84},84,84]
["Monthly EMI Loan (Rs.)",{"$f":"((PMT(B9/12,B10*12,-B8))+(B5/B11))","v":14184.926651919232},{"$f":"((PMT(C9/12,C10*12,-C8))+(C5/C11))","v":10415.065258414583},10083.156585344228,13028.846058843628]
["Total interest paid",{"$f":"(B12*B10*12)-B8","v":340133.83876121556},{"$f":"(C12*C10*12)-C8","v":219665.48170682485},212665.15316891507,274793.06894286489]
["Yearly Interest Paid",{"$f":"B13/B10","v":48590.548394459365},{"$f":"C13/C10","v":31380.783100974979},{"$f":"D13/D10","v":30380.736166987866},{"$f":"E13/E10","v":39256.152706123554}]
["EMI per KM (Rs.)",{"$f":"B14/Summary!B4","v":1.2102253647436954},{"$f":"C14/Summary!B4","v":0.78158862019862962},{"$f":"D14/Summary!B4","v":0.75668085098350846},{"$f":"E14/Summary!B4","v":0.97773730276770998}]
{"$rows_left_out":10}
{"sheet":"TCO_1","index":7,"n_rows":40,"n_cols":13,"rows_kept":40,"cut":false,"hidden":true,"merged":[]}
["Parameter","Unit","e-4W ","CNG-4W","Petrol-4W","Diesel-4W"]
["Discount rate value","-",{"$f":"Summary!B10","v":0.1},{"$f":"Summary!C10","v":0.1},{"$f":"Summary!D10","v":0.1},{"$f":"Summary!E10","v":0.1}]
["Resale rate value","-",{"$f":"Summary!B11","v":0.2},{"$f":"Summary!C11","v":0.1},{"$f":"Summary!D11","v":0.1},{"$f":"Summary!E11","v":0.1}]
["Capital recovery factor (CRF)_N","-",{"$f":"C2*(1+C2)^Summary!B3","v":0.2593742460100002},{"$f":"D2*(1+D2)^Summary!B3","v":0.2593742460100002},{"$f":"E2*(1+E2)^Summary!B3","v":0.2593742460100002},{"$f":"F2*(1+F2)^Summary!B3","v":0.2593742460100002}]
["Capital recovery factor (CRF)_D","-",{"$f":"((1+C2)^Summary!B3)-1","v":1.5937424601000019},{"$f":"(1+D2)^Summary!B3-1","v":1.5937424601000019},{"$f":"(1+E2)^Summary!B3-1","v":1.5937424601000019},{"$f":"(1+F2)^Summary!B3-1","v":1.5937424601000019}]
["CRF","-",{"$f":"C4/C5","v":0.16274539488251155},{"$f":"D4/D5","v":0.16274539488251155},{"$f":"E4/E5","v":0.16274539488251155},{"$f":"F4/F5","v":0.16274539488251155}]
["Present value factor (PVF)","-",{"$f":"1/(1+C2)^10","v":0.38554328942953148},{"$f":"1/(1+D2)^Summary!B3","v":0.38554328942953148},{"$f":"1/(1+E2)^Summary!B3","v":0.38554328942953148},{"$f":"1/(1+F2)^Summary!B3","v":0.38554328942953148}]
["Residual value (RV)","₹",{"$f":"Summary!B14*C3","v":321016.16775224311},{"$f":"Summary!C14*D3","v":106444.04817068249},{"$f":"Summary!D14*E3","v":101188.51531689151},{"$f":"Summary!E14*F3","v":130190.50689428649}]
["Annual Travel Distance","km",{"$f":"Summary!$B$4","v":40150},{"$f":"Summary!$B$4","v":40150},{"$f":"Summary!$B$4","v":40150},{"$f":"Summary!$B$4","v":40150}]
["Capex component","₹",{"$f":"((Summary!B19-(C8*C7))*C6)","v":206575.20499816936},{"$f":"(Summary!C19-(D8*D7))*D6","v":166553.91268894548},{"$f":"(Summary!D19-(E8*E7))*E6","v":158330.53547709234},{"$f":"(Summary!E19-(F8*F7))*F6","v":203710.19977961364}]
["TCO","₹/km",{"$f":"(C10+L22)/C9","v":5.9507885877641753},{"$f":"(D10+L23)/D9","v":5.237087933633048},{"$f":"(E10+L24)/E9","v":7.0723875403774343},{"$f":"(F10+L25)/F9","v":7.2830694009171024}]
[]
["Opex / year"]
["Vehicle type","Unit",1,{"$f":"C14+1","v":2},3,4,5,6,7,8,9,10,"Total"]
["e-4W ","₹",{"$f":"Summary!$B$27/(1+$C$2)^C14","v":47860.397714043815},{"$f":"Summary!$B$27/(1+$C$2)^D14","v":43509.452467312556},{"$f":"Summary!$B$27/(1+$C$2)^E14","v":39554.04769755686},{"$f":"Summary!$B$27/(1+$C$2)^F14","v":35958.225179597146},{"$f":"Summary!$B$27/(1+$C$2)^G14","v":32689.295617815587},{"$f":"Summary!$B$27/(1+$C$2)^H14","v":29717.541470741438},{"$f":"Summary!$B$27/(1+$C$2)^I14","v":27015.946791583123},{"$f":"Summary!$B$27/(1+$C$2)^J14","v":24559.951628711933},{"$f":"Summary!$B$27/(1+$C$2)^K14","v":22327.228753374482},{"$f":"Summary!$B$27/(1+$C$2)^L14","v":20297.48068488589},{"$f":"SUM(C15:L15)/Summary!B3","v":32348.956800562279}]
{"$rows_left_out":26}
{"sheet":"Plots","index":8,"n_rows":42,"n_cols":5,"rows_kept":42,"cut":false,"hidden":true,"merged":[]}
["Model","TCO"]
["e-Car",{"$f":"[2]TCO_1!C11","v":3.1768764497727382}]
["CNG-Car",{"$f":"[2]TCO_1!D11","v":3.1012269708816906}]
["Petrol-Car",{"$f":"[2]TCO_1!E11","v":4.4938726513437954}]
["Diesel-Car",{"$f":"[2]TCO_1!F11","v":4.2278623963331166}]
[]
[]
[]
[]
["Operational Years","e-Car ","CNG-Car ","Petrol-Car ","Diesel-Car "]
["Year 1",{"$f":"[2]TCO_1!C31","v":14.991052909175719},{"$f":"[2]TCO_1!C34","v":13.949635770973739},{"$f":"[2]TCO_1!C37","v":16.927784104971625},{"$f":"[2]TCO_1!C40","v":17.981274200199305}]
["Year 2",{"$f":"[2]TCO_1!D31","v":8.5683316975452133},{"$f":"[2]TCO_1!D34","v":8.1266326824598796},{"$f":"[2]TCO_1!D37","v":10.46072332783341},{"$f":"[2]TCO_1!D40","v":10.664237152990371}]
["Year 3",{"$f":"[2]TCO_1!E31","v":6.397295393518144},{"$f":"[2]TCO_1!E34","v":6.1427010089531224},{"$f":"[2]TCO_1!E37","v":8.2135274093332793},{"$f":"[2]TCO_1!E40","v":8.1574600489208446}]
["Year 4",{"$f":"[2]TCO_1!F31","v":5.2916496985994019},{"$f":"[2]TCO_1!F34","v":5.1218389553928541},{"$f":"[2]TCO_1!F37","v":7.0279483626020767},{"$f":"[2]TCO_1!F40","v":6.8583375789576557}]
["Year 5",{"$f":"[2]TCO_1!G31","v":4.6139477792328218},{"$f":"[2]TCO_1!G34","v":4.4885984684846258},{"$f":"[2]TCO_1!G37","v":6.2718445985780216},{"$f":"[2]TCO_1!G40","v":6.0459690480125872}]
{"$rows_left_out":28}
{"sheet":"References","index":9,"n_rows":35,"n_cols":14,"rows_kept":35,"cut":false,"hidden":true,"merged":[]}
[]
[null,"Assumption",null,null,null,"Source"]
[null,"Life of Vehicle",null,null,null,"Assumed"]
[null,"Annual driving distance",null,null,null,"Assumed"]
[null,"Total distance travelled",null,null,null,"Assumed"]
[null,"LIB cost",null,null,null,"https://bnef.turtl.co/story/evo2018?teaser=true ",null,null,null,null,"BNEF EV Outlook 2018 ($200/kWh)"]
[null,"Discount rate",null,null,null,"Assumed"]
[null,"Resale value",null,null,null,"Assumed"]
[null,"Purchase cost (e-4W) + Tax + Insurance",null,null,null,"https://www.zigwheels.com/newcars/Mahindra/e-verito/on-road-price-delhi"]
[null,"Purchase cost (CNG-4W) + Tax + Insurance",null,null,null,"https://www.zigwheels.com/newcars/Hyundai/aura/on-road-price-delhi",null,null,null,null,null,null,null,"(Refer Hundai Aura S CNG Model)"]
[null,"Purchase cost (Petrol-4W) + Tax + Insurance",null,null,null,"https://www.zigwheels.com/newcars/Hyundai/aura/on-road-price-delhi",null,null,null,null,null,null,null,"(Refer Hundai Aura SX Plus AMT Petrol Model)"]
[null,"Purchase cost (Diesel-4W) + Tax + Insurance",null,null,null,"https://www.zigwheels.com/newcars/Hyundai/aura/on-road-price-delhi",null,null,null,null,null,null,null,"(Refer Hundai Aura SX Plus AMT Diesel Model)"]
[null,"Fuel cost (e-4W)",null,null,null,"http://transport.delhi.gov.in/sites/default/files/All-PDF/Electric%20Policy%202018.pdf"]
[null,"Fuel cost (CNG-4W)",null,null,null,"To be added by Parveen"]
[null,"Fuel cost (Petrol-4W)",null,null,null,"https://www.iocl.com/Product_PreviousPrice/PetrolPreviousPriceDynamic.aspx"]
{"$rows_left_out":20}